Reaction Details
TargetPhosphatidylinositol 4,5-bisphosphate 3-kinase catalytic subunit delta isoform
LigandBDBM341234
Substrate/Competitorn/a
Meas. Tech.TR-FRET assay
IC50 0.600±n/a nM
Citation Evarts, JKaplan, JKim, MNaduthambi, DPatel, LPerreault, SPhillips, GPurvis, II, LJStevens, KLTreiberg, JA Phosphatidylinositol 3-kinase inhibitors US Patent US9765060 Publication Date 9/19/2017
 
Phosphatidylinositol 4,5-bisphosphate 3-kinase catalytic subunit delta isoform
Name:Phosphatidylinositol 4,5-bisphosphate 3-kinase catalytic subunit delta isoform
Type:Enzyme Subunit
Mol. Mass.:119489.41
Organism:Homo sapiens (Human)
Description:O00329
Residue:1044
BDBM341234
NameBDBM341234
Synonyms:(S)-2,4-diamino-6-((1-(5-(3-morpholinopropyl)-4-oxo-3-phenyl-3,4-dihydroquinazoline-2-yl)ethyl)amino)pyrimidine-5-carbonitrile | US9765060, Compound 61
TypeSmall organic molecule
Emp. Form.C28H31N9O2
Mol. Mass.525.6048
SMILESC[C@H](Nc1nc(N)nc(N)c1C#N)c1nc2cccc(CCCN3CCOCC3)c2c(=O)n1-c1ccccc1