Reaction Details
TargetPhosphatidylinositol 4,5-bisphosphate 3-kinase catalytic subunit delta isoform
LigandBDBM341236
Substrate/Competitorn/a
Meas. Tech.TR-FRET assay
IC50 0.800±n/a nM
Citation Evarts, JKaplan, JKim, MNaduthambi, DPatel, LPerreault, SPhillips, GPurvis, II, LJStevens, KLTreiberg, JA Phosphatidylinositol 3-kinase inhibitors US Patent US9765060 Publication Date 9/19/2017
 
Phosphatidylinositol 4,5-bisphosphate 3-kinase catalytic subunit delta isoform
Name:Phosphatidylinositol 4,5-bisphosphate 3-kinase catalytic subunit delta isoform
Type:Enzyme Subunit
Mol. Mass.:119489.41
Organism:Homo sapiens (Human)
Description:O00329
Residue:1044
BDBM341236
NameBDBM341236
Synonyms:(S)-4-((1-(5-(3-(2-oxa-6-azaspiro[3.4]octan-6-yl)propyl)-4-oxo-3-phenyl-3,4-dihydroquinazolin-2-yl)ethyl)amino)-2,6-diaminopyrimidine-5-carbonitrile | US9765060, Compound 63
TypeSmall organic molecule
Emp. Form.C30H33N9O2
Mol. Mass.551.6421
SMILESC[C@H](Nc1nc(N)nc(N)c1C#N)c1nc2cccc(CCCN3CCC4(COC4)C3)c2c(=O)n1-c1ccccc1