Reaction Details
TargetProtein arginine N-methyltransferase 5
LigandBDBM336960
Substrate/Competitorn/a
Meas. Tech.Biochemical Assay
IC50<100±n/a nM
Citation Duncan, KWChesworth, RBoriack-Sjodin, PAMunchhof, MJJin, L PRMT5 inhibitors and uses thereof US Patent US9765068 Publication Date 9/19/2017
 
Protein arginine N-methyltransferase 5
Name:Protein arginine N-methyltransferase 5
Type:Enzyme
Mol. Mass.:72679.99
Organism:Homo sapiens (Human)
Description:O14744
Residue:637
BDBM336960
NameBDBM336960
Synonyms:US9745291, Compound 6 | US9765068, Compound 6
TypeSmall organic molecule
Emp. Form.C23H25N3O3
Mol. Mass.391.4629
SMILESOC(CNC(=O)COc1cccc2cccnc12)CN1CCc2ccccc2C1