Reaction Details
TargetProtein arginine N-methyltransferase 5
LigandBDBM336974
Substrate/Competitorn/a
Meas. Tech.Biochemical Assay
IC50<100±n/a nM
Citation Duncan, KWChesworth, RBoriack-Sjodin, PAMunchhof, MJJin, L PRMT5 inhibitors and uses thereof US Patent US9765068 Publication Date 9/19/2017
 
Protein arginine N-methyltransferase 5
Name:Protein arginine N-methyltransferase 5
Type:Enzyme
Mol. Mass.:72679.99
Organism:Homo sapiens (Human)
Description:O14744
Residue:637
BDBM336974
NameBDBM336974
Synonyms:US9745291, Compound 20 | US9765068, Compound 20
TypeSmall organic molecule
Emp. Form.C21H26N2O4
Mol. Mass.370.4421
SMILESCOc1cccc(OCC(=O)NCC(O)CN2CCc3ccccc3C2)c1