Reaction Details
TargetProtein arginine N-methyltransferase 5
LigandBDBM336982
Substrate/Competitorn/a
Meas. Tech.Biochemical Assay
IC50<100±n/a nM
Citation Duncan, KWChesworth, RBoriack-Sjodin, PAMunchhof, MJJin, L PRMT5 inhibitors and uses thereof US Patent US9765068 Publication Date 9/19/2017
 
Protein arginine N-methyltransferase 5
Name:Protein arginine N-methyltransferase 5
Type:Enzyme
Mol. Mass.:72679.99
Organism:Homo sapiens (Human)
Description:O14744
Residue:637
BDBM336982
NameBDBM336982
Synonyms:US9745291, Compound 28 | US9765068, Compound 28
TypeSmall organic molecule
Emp. Form.C21H27N3O5S
Mol. Mass.433.521
SMILESCS(=O)(=O)Nc1cccc(OCC(=O)NCC(O)CN2CCc3ccccc3C2)c1