Reaction Details
TargetProtein arginine N-methyltransferase 5
LigandBDBM337022
Substrate/Competitorn/a
Meas. Tech.Biochemical Assay
IC50<100±n/a nM
Citation Duncan, KWChesworth, RBoriack-Sjodin, PAMunchhof, MJJin, L PRMT5 inhibitors and uses thereof US Patent US9765068 Publication Date 9/19/2017
 
Protein arginine N-methyltransferase 5
Name:Protein arginine N-methyltransferase 5
Type:Enzyme
Mol. Mass.:72679.99
Organism:Homo sapiens (Human)
Description:O14744
Residue:637
BDBM337022
NameBDBM337022
Synonyms:US9745291, Compound 68 | US9765068, Compound 68
TypeSmall organic molecule
Emp. Form.C23H26N4O3
Mol. Mass.406.4775
SMILESO[C@@H](CNC(=O)COc1ccccc1-c1cc[nH]n1)CN1CCc2ccccc2C1