Reaction Details
TargetProtein arginine N-methyltransferase 5
LigandBDBM337025
Substrate/Competitorn/a
Meas. Tech.Biochemical Assay
IC50<100±n/a nM
Citation Duncan, KWChesworth, RBoriack-Sjodin, PAMunchhof, MJJin, L PRMT5 inhibitors and uses thereof US Patent US9765068 Publication Date 9/19/2017
 
Protein arginine N-methyltransferase 5
Name:Protein arginine N-methyltransferase 5
Type:Enzyme
Mol. Mass.:72679.99
Organism:Homo sapiens (Human)
Description:O14744
Residue:637
BDBM337025
NameBDBM337025
Synonyms:US9745291, Compound 71 | US9765068, Compound 71
TypeSmall organic molecule
Emp. Form.C27H35N5O3
Mol. Mass.477.5985
SMILESCN1CCC(CC1)n1ncc2ccc(OCC(=O)NCC(O)CN3CCc4ccccc4C3)cc12