Reaction Details
TargetProtein arginine N-methyltransferase 5
LigandBDBM337049
Substrate/Competitorn/a
Meas. Tech.Biochemical Assay
IC50<100±n/a nM
Citation Duncan, KWChesworth, RBoriack-Sjodin, PAMunchhof, MJJin, L PRMT5 inhibitors and uses thereof US Patent US9765068 Publication Date 9/19/2017
 
Protein arginine N-methyltransferase 5
Name:Protein arginine N-methyltransferase 5
Type:Enzyme
Mol. Mass.:72679.99
Organism:Homo sapiens (Human)
Description:O14744
Residue:637
BDBM337049
NameBDBM337049
Synonyms:US9745291, Compound 95 | US9765068, Compound 95
TypeSmall organic molecule
Emp. Form.C25H31N5O3
Mol. Mass.449.5453
SMILESOC(CNC(=O)COc1ccc2n(ncc2c1)C1CCNC1)CN1CCc2ccccc2C1