Reaction Details
TargetProtein arginine N-methyltransferase 5
LigandBDBM337109
Substrate/Competitorn/a
Meas. Tech.Biochemical Assay
IC50<100±n/a nM
Citation Duncan, KWChesworth, RBoriack-Sjodin, PAMunchhof, MJJin, L PRMT5 inhibitors and uses thereof US Patent US9765068 Publication Date 9/19/2017
 
Protein arginine N-methyltransferase 5
Name:Protein arginine N-methyltransferase 5
Type:Enzyme
Mol. Mass.:72679.99
Organism:Homo sapiens (Human)
Description:O14744
Residue:637
BDBM337109
NameBDBM337109
Synonyms:US9745291, Compound 155 | US9765068, Compound 155
TypeSmall organic molecule
Emp. Form.C22H29N3O5S
Mol. Mass.447.548
SMILESCN(c1ccccc1OCC(=O)NCC(O)CN1CCc2ccccc2C1)S(C)(=O)=O