Reaction Details
TargetTryptophan 5-hydroxylase 1
LigandBDBM341348
Substrate/Competitorn/a
Meas. Tech.Biochemical In Vitro Assay
IC50 4.00±n/a nM
Citation Bur, DGrisostomi, CNayler, ORemen, LVercauteren, MWelford, R Tricyclic piperidine compounds US Patent US9765092 Publication Date 9/19/2017
 
Tryptophan 5-hydroxylase 1
Name:Tryptophan 5-hydroxylase 1
Type:PROTEIN
Mol. Mass.:50990.64
Organism:Homo sapiens (Human)
Description:ChEMBL_1361824
Residue:444
BDBM341348
NameBDBM341348
Synonyms:2-((4-chloro-2-(dimethylamino)pyrimidin-5-yl)oxy)-1-(5-(4-chloro-2-fluorophenyl)-2-methyl-7,8-dihydro-[1,3,4]thiadiazolo[2',3':2,3]imidazo[4,5-c]pyridin-6(5H)-yl)ethanone | US9765092, Example 1.4.40
TypeSmall organic molecule
Emp. Form.C22H20Cl2FN7O2S
Mol. Mass.536.409
SMILESCN(C)c1ncc(OCC(=O)N2CCc3nc4sc(C)nn4c3C2c2ccc(Cl)cc2F)c(Cl)n1