Reaction Details
TargetTryptophan 5-hydroxylase 1
LigandBDBM341445
Substrate/Competitorn/a
Meas. Tech.Biochemical In Vitro Assay
IC50 5.00±n/a nM
Citation Bur, DGrisostomi, CNayler, ORemen, LVercauteren, MWelford, R Tricyclic piperidine compounds US Patent US9765092 Publication Date 9/19/2017
 
Tryptophan 5-hydroxylase 1
Name:Tryptophan 5-hydroxylase 1
Type:PROTEIN
Mol. Mass.:50990.64
Organism:Homo sapiens (Human)
Description:ChEMBL_1361824
Residue:444
BDBM341445
NameBDBM341445
Synonyms:1-(5-(6-chloro-2-fluoropyridin-3-yl)-2-methyl-7,8-dihydro-[1,3,4]thiadiazolo[2',3':2,3]imidazo[4,5-c]pyridin-6(5H)-yl)-2-(2-chloro-4-(trifluoromethyl)phenoxy)ethanone | US9765092, Example 1.16.7
TypeSmall organic molecule
Emp. Form.C22H15Cl2F4N5O2S
Mol. Mass.560.351
SMILESCc1nn2c3C(N(CCc3nc2s1)C(=O)COc1ccc(cc1Cl)C(F)(F)F)c1ccc(Cl)nc1F