Reaction Details
TargetTryptophan 5-hydroxylase 1
LigandBDBM341456
Substrate/Competitorn/a
Meas. Tech.Biochemical In Vitro Assay
IC50 5.00±n/a nM
Citation Bur, DGrisostomi, CNayler, ORemen, LVercauteren, MWelford, R Tricyclic piperidine compounds US Patent US9765092 Publication Date 9/19/2017
 
Tryptophan 5-hydroxylase 1
Name:Tryptophan 5-hydroxylase 1
Type:PROTEIN
Mol. Mass.:50990.64
Organism:Homo sapiens (Human)
Description:ChEMBL_1361824
Residue:444
BDBM341456
NameBDBM341456
Synonyms:6-chloro-5-(2-(5-(3-fluorothiophen-2-yl)-2-methyl-7,8-dihydro-[1,3,4]thiadiazolo[2',3':2,3]imidazo[4,5-c]pyridin-6(5H)-yl)-2-oxoethoxy)-N,N-dimethylpicolinamide | US9765092, Example 1.23.6
TypeSmall organic molecule
Emp. Form.C22H20ClFN6O3S2
Mol. Mass.535.014
SMILESCN(C)C(=O)c1ccc(OCC(=O)N2CCc3nc4sc(C)nn4c3C2c2sccc2F)c(Cl)n1