Reaction Details
TargetTryptophan 5-hydroxylase 1
LigandBDBM341471
Substrate/Competitorn/a
Meas. Tech.Biochemical In Vitro Assay
IC50 5.00±n/a nM
Citation Bur, DGrisostomi, CNayler, ORemen, LVercauteren, MWelford, R Tricyclic piperidine compounds US Patent US9765092 Publication Date 9/19/2017
 
Tryptophan 5-hydroxylase 1
Name:Tryptophan 5-hydroxylase 1
Type:PROTEIN
Mol. Mass.:50990.64
Organism:Homo sapiens (Human)
Description:ChEMBL_1361824
Residue:444
BDBM341471
NameBDBM341471
Synonyms:5-(6-(2-((2-chloro-6-(3,3-difluoroazetidin-1-yl)pyridin-3-yl)oxy)acetyl)-2-methyl-5,6,7,8-tetrahydro-[1,3,4]thiadiazolo[2',3':2,3]imidazo[4,5-c]pyridin-5-yl)-4-fluoro-N,N-dimethylthiophene-2-carboxamide | US9765092, Example 1.24.6
TypeSmall organic molecule
Emp. Form.C25H23ClF3N7O3S2
Mol. Mass.626.073
SMILESCN(C)C(=O)c1cc(F)c(s1)C1N(CCc2nc3sc(C)nn3c12)C(=O)COc1ccc(nc1Cl)N1CC(F)(F)C1