Reaction Details
TargetTryptophan 5-hydroxylase 1
LigandBDBM341569
Substrate/Competitorn/a
Meas. Tech.Biochemical In Vitro Assay
IC50 5.00±n/a nM
Citation Bur, DGrisostomi, CNayler, ORemen, LVercauteren, MWelford, R Tricyclic piperidine compounds US Patent US9765092 Publication Date 9/19/2017
 
Tryptophan 5-hydroxylase 1
Name:Tryptophan 5-hydroxylase 1
Type:PROTEIN
Mol. Mass.:50990.64
Organism:Homo sapiens (Human)
Description:ChEMBL_1361824
Residue:444
BDBM341569
NameBDBM341569
Synonyms:2-((2-chloro-6-(1,1-dioxidoisothiazolidin-2-yl)pyridin-3-yl)oxy)-1-(5-(2,4-dimethylthiazol-5-yl)-2-methyl-7,8-dihydro-[1,3,4]thiadiazolo[2',3':2,3]imidazo[4,5-c]pyridin-6(5H)-yl)ethanone | US9765092, Example 1.68.5
TypeSmall organic molecule
Emp. Form.C23H24ClN7O4S3
Mol. Mass.594.129
SMILESCc1nc(C)c(s1)C1N(CCc2nc3sc(C)nn3c12)C(=O)COc1ccc(nc1Cl)N1CCCS1(=O)=O