Reaction Details
TargetTryptophan 5-hydroxylase 1
LigandBDBM341715
Substrate/Competitorn/a
Meas. Tech.Biochemical In Vitro Assay
IC50 3.00±n/a nM
Citation Bur, DGrisostomi, CNayler, ORemen, LVercauteren, MWelford, R Tricyclic piperidine compounds US Patent US9765092 Publication Date 9/19/2017
 
Tryptophan 5-hydroxylase 1
Name:Tryptophan 5-hydroxylase 1
Type:PROTEIN
Mol. Mass.:50990.64
Organism:Homo sapiens (Human)
Description:ChEMBL_1361824
Residue:444
BDBM341715
NameBDBM341715
Synonyms:1-(5-(4-Chloro-2-fluorophenyl)-2-methyl-7,8-dihydro-[1,3,4]thiadiazolo[2',3':2,3]imidazo[4,5-c]pyridin-6(5H)-yl)-2-((2-chloro-6-((3S,5S)-3,5-dimethylpipe-ridin-1-yl)pyridin-3-yl)oxy)ethanone | US9765092, Example 1.4.20
TypeSmall organic molecule
Emp. Form.C28H29Cl2FN6O2S
Mol. Mass.603.538
SMILESC[C@H]1C[C@H](C)CN(C1)c1ccc(OCC(=O)N2CCc3nc4sc(C)nn4c3C2c2ccc(Cl)cc2F)c(Cl)n1