Reaction Details
TargetTryptophan 5-hydroxylase 1
LigandBDBM341726
Substrate/Competitorn/a
Meas. Tech.Biochemical In Vitro Assay
IC50 4.00±n/a nM
Citation Bur, DGrisostomi, CNayler, ORemen, LVercauteren, MWelford, R Tricyclic piperidine compounds US Patent US9765092 Publication Date 9/19/2017
 
Tryptophan 5-hydroxylase 1
Name:Tryptophan 5-hydroxylase 1
Type:PROTEIN
Mol. Mass.:50990.64
Organism:Homo sapiens (Human)
Description:ChEMBL_1361824
Residue:444
BDBM341726
NameBDBM341726
Synonyms:1-(5-(4-Chloro-2-fluorophenyl)-2-methyl-7,8-dihydro-[1,3,4]thiadiazolo[2',3':2,3]imidazo[4,5-c]pyridin-6(5H)-yl)-2-(2-chloro-4-cyclopropylphenoxy)-ethanone | US9765092, Example 1.4.34
TypeSmall organic molecule
Emp. Form.C25H21Cl2FN4O2S
Mol. Mass.531.429
SMILESCc1nn2c3C(N(CCc3nc2s1)C(=O)COc1ccc(cc1Cl)C1CC1)c1ccc(Cl)cc1F