Reaction Details
TargetTryptophan 5-hydroxylase 1
LigandBDBM341730
Substrate/Competitorn/a
Meas. Tech.Biochemical In Vitro Assay
IC50 5.00±n/a nM
Citation Bur, DGrisostomi, CNayler, ORemen, LVercauteren, MWelford, R Tricyclic piperidine compounds US Patent US9765092 Publication Date 9/19/2017
 
Tryptophan 5-hydroxylase 1
Name:Tryptophan 5-hydroxylase 1
Type:PROTEIN
Mol. Mass.:50990.64
Organism:Homo sapiens (Human)
Description:ChEMBL_1361824
Residue:444
BDBM341730
NameBDBM341730
Synonyms:5-(6-(2-((2-chloro-6-morpholinopyridin-3-yl)oxy)acetyl)-2-methyl-5,6,7,8-tetrahydro-[1,3,4]thiadiazolo[2',3':2,3]imidazo[4,5-c]pyridin-5-yl)-N,N-dimethyl-thiophene-3-carboxamide | US9765092, Example 1.9.1
TypeSmall organic molecule
Emp. Form.C26H28ClN7O4S2
Mol. Mass.602.128
SMILESCN(C)C(=O)c1csc(c1)C1N(CCc2nc3sc(C)nn3c12)C(=O)COc1ccc(nc1Cl)N1CCOCC1