Reaction Details
TargetLarge neutral amino acids transporter small subunit 1
LigandBDBM340540
Substrate/Competitorn/a
Meas. Tech.Inhibitory Activity Assay
IC50 76000±n/a nM
Citation Kanai, YNagamori, SKitaura, YNeya, MMatsushita, N Phenoxyalkylamine compound US Patent US9771316 Publication Date 9/26/2017
 
Large neutral amino acids transporter small subunit 1
Name:Large neutral amino acids transporter small subunit 1
Type:PROTEIN
Mol. Mass.:55013.61
Organism:Homo sapiens (Human)
Description:ChEMBL_100160
Residue:507
BDBM340540
NameBDBM340540
Synonyms:US9771316, Example 29
TypeSmall organic molecule
Emp. Form.C18H19F4NO
Mol. Mass.341.3432
SMILESNCCCCC(Oc1ccc(c(F)c1)C(F)(F)F)c1ccccc1