Reaction Details
TargetLarge neutral amino acids transporter small subunit 1
LigandBDBM340560
Substrate/Competitorn/a
Meas. Tech.Inhibitory Activity Assay
IC50 123000±n/a nM
Citation Kanai, YNagamori, SKitaura, YNeya, MMatsushita, N Phenoxyalkylamine compound US Patent US9771316 Publication Date 9/26/2017
 
Large neutral amino acids transporter small subunit 1
Name:Large neutral amino acids transporter small subunit 1
Type:PROTEIN
Mol. Mass.:55013.61
Organism:Homo sapiens (Human)
Description:ChEMBL_100160
Residue:507
BDBM340560
NameBDBM340560
Synonyms:US9771316, Example 50
TypeSmall organic molecule
Emp. Form.C16H18F3NO2S
Mol. Mass.345.38
SMILESNCCCCC(Oc1ccc(OC(F)(F)F)cc1)c1cccs1