Reaction Details
TargetUrokinase-type plasminogen activator
LigandBDBM14351
Substrate/CompetitorBDBM13949
Meas. Tech.Enzyme Assay and Determination of the Inhibition Constants
Ki 2.6±n/a nM
Citation Katz, BAElrod, KVerner, EMackman, RLLuong, CShrader, WDSendzik, MSpencer, JRSprengeler, PAKolesnikov, ATai, VWHui, HCBreitenbucher, JGAllen, DJanc, JW Elaborate manifold of short hydrogen bond arrays mediating binding of active site-directed serine protease inhibitors. J Mol Biol329:93-120 (2003) 
 
Urokinase-type plasminogen activator
Name:Urokinase-type plasminogen activator
Type:Enzyme
Mol. Mass.:48528.62
Organism:Homo sapiens (Human)
Description:P00749
Residue:431
BDBM14351
BDBM13949
NameBDBM14351
Synonyms:2-{5-[amino(iminiumyl)methyl]-6-chloro-1H-indol-2-yl}-4-methoxy-6-phenylbenzen-1-olate | CRA-11260
TypeSmall organic molecule
Emp. Form.C22H18ClN3O2
Mol. Mass.391.85
SMILESCOc1cc(-c2cc3cc(C(N)=[NH2+])c(Cl)cc3[nH]2)c([O-])c(c1)-c1ccccc1