Reaction Details
TargetMitogen-activated protein kinase 12
LigandBDBM342111
Substrate/Competitorn/a
Meas. Tech.Enzyme Inhibition
IC50 13.0±n/a nM
Citation Fyfe, MC Kinase inhibitors based upon N-alkyl pyrazoles US Patent US9771353 Publication Date 9/26/2017
 
Mitogen-activated protein kinase 12
Name:Mitogen-activated protein kinase 12
Type:Protein
Mol. Mass.:41938.69
Organism:Homo sapiens (Human)
Description:P53778
Residue:367
BDBM342111
NameBDBM342111
Synonyms:3-Ethynyl-5-((4-((4-(3-(3-isopropyl-1-methyl-1H-pyrazol-5-yl)ureido)naphthalen-1-yl)oxy)pyrimidin-2-yl)amino)-N-(2-(2-(2-methoxyethoxy)ethoxy)ethyl)benzamide | US9771353, Example 11
TypeSmall organic molecule
Emp. Form.C38H42N8O6
Mol. Mass.706.7901
SMILESCOCCOCCOCCNC(=O)c1cc(Nc2nccc(Oc3ccc(NC(=O)Nc4cc(nn4C)C(C)C)c4ccccc34)n2)cc(c1)C#C