Reaction Details
TargetRibosomal protein S6 kinase alpha-2
LigandBDBM286091
Substrate/Competitorn/a
Meas. Tech.Kinase Assay
IC50 20±0.0 nM
Citation Dunn, SEJayanthan, ANagireddy, JRAnnedi, SVan Drie, JHDaynard, TSHuynh, M Substituted tetrahydropyrido[3′,2′:4,5]pyrrolo[1,2-a]pyrazine-2-carboxamides as RSK inhibitors US Patent US9771366 Publication Date 9/26/2017
 
Ribosomal protein S6 kinase alpha-2
Name:Ribosomal protein S6 kinase alpha-2
Type:Serine/threonine-protein kinase
Mol. Mass.:83259.46
Organism:Homo sapiens (Human)
Description:n/a
Residue:733
BDBM286091
NameBDBM286091
Synonyms:(R)¿N-(1-(4-aminobenzyl)-1H-pyrazol-4-yl)-9-methyl-6-oxo-6,7,8,9-tetrahydropyrido[3′,2′:4,5]pyrrolo[1,2-a]pyrazine-2-carboxamide US10081632, Compound 18 | US10758530, Compound 18
TypeSmall organic molecule
Emp. Form.C22H21N7O2
Mol. Mass.415.4478
SMILESC[C@@H]1CNC(=O)c2cc3ccc(nc3n12)C(=O)Nc1cnn(Cc2ccc(N)cc2)c1