Reaction Details
TargetMast/stem cell growth factor receptor Kit
LigandBDBM342338
Substrate/Competitorn/a
Meas. Tech.Biochemical Assay
Ki 500±n/a nM
Citation Lin, JPham, PBuell, JSpevak, W Compounds and methods for kinase modulation, and indications therefor US Patent US9771369 Publication Date 9/26/2017
 
Mast/stem cell growth factor receptor Kit
Name:Mast/stem cell growth factor receptor Kit
Type:Protein
Mol. Mass.:109869.37
Organism:Homo sapiens (Human)
Description:P10721
Residue:976
BDBM342338
NameBDBM342338
Synonyms:6-[1-(difluoromethyl)pyrazol-4-yl]-4-[4- [5-(4-ethoxyphenyl)-4-methyl-1H- imidazol-2-yl]-4-methyl-1-piperidyl]- 7H-pyrrolo[2,3-d]pyrimidine | US9771369, Compound P-3170
TypeSmall organic molecule
Emp. Form.C28H30F2N8O
Mol. Mass.532.5876
SMILESCCOc1ccc(cc1)-c1[nH]c(nc1C)C1(C)CCN(CC1)c1ncnc2[nH]c(cc12)-c1cnn(c1)C(F)F