Reaction Details
TargetMast/stem cell growth factor receptor Kit
LigandBDBM342346
Substrate/Competitorn/a
Meas. Tech.Biochemical Assay
Ki 500±n/a nM
Citation Lin, JPham, PBuell, JSpevak, W Compounds and methods for kinase modulation, and indications therefor US Patent US9771369 Publication Date 9/26/2017
 
Mast/stem cell growth factor receptor Kit
Name:Mast/stem cell growth factor receptor Kit
Type:Protein
Mol. Mass.:109869.37
Organism:Homo sapiens (Human)
Description:P10721
Residue:976
BDBM342346
NameBDBM342346
Synonyms:6-(6-methoxy-3-pyridyl)-4-[4-methyl-4- [4-methyl-5-[4-(trifluoromethyl)phenyl]- 1H-imidazol-2-yl]-1-piperidyl]-7H- pyrrolo[2,3-d]pyrimidine | US9771369, Compound P-3178
TypeSmall organic molecule
Emp. Form.C29H28F3N7O
Mol. Mass.547.5741
SMILESCOc1ccc(cn1)-c1cc2c(ncnc2[nH]1)N1CCC(C)(CC1)c1nc(C)c([nH]1)-c1ccc(cc1)C(F)(F)F