Reaction Details
TargetMast/stem cell growth factor receptor Kit
LigandBDBM342416
Substrate/Competitorn/a
Meas. Tech.Biochemical Assay
Ki 500±n/a nM
Citation Lin, JPham, PBuell, JSpevak, W Compounds and methods for kinase modulation, and indications therefor US Patent US9771369 Publication Date 9/26/2017
 
Mast/stem cell growth factor receptor Kit
Name:Mast/stem cell growth factor receptor Kit
Type:Protein
Mol. Mass.:109869.37
Organism:Homo sapiens (Human)
Description:P10721
Residue:976
BDBM342416
NameBDBM342416
Synonyms:4-[4-[4-[5-[4-(difluoromethoxy)phenyl]- 4-methyl-1H-imidazol-2-yl]-4-methyl-1- piperidyl]-7H-pyrrolo[2,3-d]pyrimidin- 6-yl]benzamide | US9771369, Compound P-3253
TypeSmall organic molecule
Emp. Form.C30H29F2N7O2
Mol. Mass.557.5938
SMILESCc1nc([nH]c1-c1ccc(OC(F)F)cc1)C1(C)CCN(CC1)c1ncnc2[nH]c(cc12)-c1ccc(cc1)C(N)=O