Reaction Details
TargetMast/stem cell growth factor receptor Kit
LigandBDBM342417
Substrate/Competitorn/a
Meas. Tech.Biochemical Assay
Ki 500±n/a nM
Citation Lin, JPham, PBuell, JSpevak, W Compounds and methods for kinase modulation, and indications therefor US Patent US9771369 Publication Date 9/26/2017
 
Mast/stem cell growth factor receptor Kit
Name:Mast/stem cell growth factor receptor Kit
Type:Protein
Mol. Mass.:109869.37
Organism:Homo sapiens (Human)
Description:P10721
Residue:976
BDBM342417
NameBDBM342417
Synonyms:N-[4-[4-[4-[5-[4- (difluoromethoxy)phenyl]-4-methyl-1H- imidazol-2-yl]-4-methyl-1-piperidyl]- 7H-pyrrolo[2,3-d]pyrimidin-6- yl]phenyl]methanesulfonamide | US9771369, Compound P-3254
TypeSmall organic molecule
Emp. Form.C30H31F2N7O3S
Mol. Mass.607.674
SMILESCc1nc([nH]c1-c1ccc(OC(F)F)cc1)C1(C)CCN(CC1)c1ncnc2[nH]c(cc12)-c1ccc(NS(C)(=O)=O)cc1