Reaction Details
TargetKetohexokinase
LigandBDBM50349741
Substrate/Competitorn/a
Meas. Tech.Enzyme Assay
IC50 230±n/a nM
Citation Zhang, XAbad, MCGibbs, ACKuo, GSong, FSui, ZKuo, LC Indazole compounds useful as ketohexokinase inhibitors US Patent US9771375 Publication Date 9/26/2017
 
Ketohexokinase
Name:Ketohexokinase
Type:Enzyme Catalytic Domain
Mol. Mass.:32521.64
Organism:Homo sapiens (Human)
Description:n/a
Residue:298
BDBM50349741
NameBDBM50349741
Synonyms:CHEMBL1809168 US9771375, Example 139
TypeSmall organic molecule
Emp. Form.C19H18FN3S
Mol. Mass.339.43
SMILESCSc1nn(-c2ccc(F)cc2)c2cc(ccc12)C1=CCNCC1