Reaction Details
TargetKetohexokinase
LigandBDBM8526
Substrate/Competitorn/a
Meas. Tech.Enzyme Assay
IC50 40.0±n/a nM
Citation Zhang, XAbad, MCGibbs, ACKuo, GSong, FSui, ZKuo, LC Indazole compounds useful as ketohexokinase inhibitors US Patent US9771375 Publication Date 9/26/2017
 
Ketohexokinase
Name:Ketohexokinase
Type:Enzyme Catalytic Domain
Mol. Mass.:32521.64
Organism:Homo sapiens (Human)
Description:n/a
Residue:298
BDBM8526
NameBDBM8526
Synonyms:CHEMBL1809170 US8822448, 184 | US9771375, Example 184
Typen/a
Emp. Form.C20H21N3S
Mol. Mass.335.466
SMILESCSc1nn(-c2ccc(C)cc2)c2cc(ccc12)C1=CCNCC1