Reaction Details
TargetSodium channel protein type 9 subunit alpha
LigandBDBM145240
Substrate/Competitorn/a
Meas. Tech.Electrophysiological Assay (In Vitro Assay)
IC50 38.6±n/a nM
Citation Chowdhury, SDehnhardt, CMFocken, TGrimwood, MEHemeon, IWJia, QOrtwine, DFSafina, BSun, SSutherlin, DPZenova, AY N-substituted benzamides and methods of use thereof US Patent US9771376 Publication Date 9/26/2017
 
Sodium channel protein type 9 subunit alpha
Name:Sodium channel protein type 9 subunit alpha
Type:Protein
Mol. Mass.:226375.97
Organism:Homo sapiens (Human)
Description:Q15858
Residue:1988
BDBM145240
NameBDBM145240
Synonyms:US8952169, 19 | US9771376, Example 19
TypeSmall organic molecule
Emp. Form.C19H24ClNO4S
Mol. Mass.397.916
SMILESCS(=O)(=O)NC(=O)c1ccc(OCC23CC4CC(CC(C4)C2)C3)c(Cl)c1