Reaction Details
TargetSodium channel protein type 9 subunit alpha
LigandBDBM145243
Substrate/Competitorn/a
Meas. Tech.Electrophysiological Assay (In Vitro Assay)
IC50 13.4±n/a nM
Citation Chowdhury, SDehnhardt, CMFocken, TGrimwood, MEHemeon, IWJia, QOrtwine, DFSafina, BSun, SSutherlin, DPZenova, AY N-substituted benzamides and methods of use thereof US Patent US9771376 Publication Date 9/26/2017
 
Sodium channel protein type 9 subunit alpha
Name:Sodium channel protein type 9 subunit alpha
Type:Protein
Mol. Mass.:226375.97
Organism:Homo sapiens (Human)
Description:Q15858
Residue:1988
BDBM145243
NameBDBM145243
Synonyms:US8952169, 22 | US9771376, Example 22
TypeSmall organic molecule
Emp. Form.C18H17ClFNO4S
Mol. Mass.397.848
SMILESCS(=O)(=O)NC(=O)c1cc(Cl)c(Oc2ccc3CCCCc3c2)cc1F