Reaction Details
TargetSodium channel protein type 9 subunit alpha
LigandBDBM145244
Substrate/Competitorn/a
Meas. Tech.Electrophysiological Assay (In Vitro Assay)
IC50 22.9±n/a nM
Citation Chowdhury, SDehnhardt, CMFocken, TGrimwood, MEHemeon, IWJia, QOrtwine, DFSafina, BSun, SSutherlin, DPZenova, AY N-substituted benzamides and methods of use thereof US Patent US9771376 Publication Date 9/26/2017
 
Sodium channel protein type 9 subunit alpha
Name:Sodium channel protein type 9 subunit alpha
Type:Protein
Mol. Mass.:226375.97
Organism:Homo sapiens (Human)
Description:Q15858
Residue:1988
BDBM145244
NameBDBM145244
Synonyms:US8952169, 23 | US9771376, Example 23
TypeSmall organic molecule
Emp. Form.C21H27ClFNO4S
Mol. Mass.443.96
SMILESCC12CC3CC(C)(C1)CC(COc1cc(F)c(cc1Cl)C(=O)NS(C)(=O)=O)(C3)C2