Reaction Details
TargetSodium channel protein type 9 subunit alpha
LigandBDBM145247
Substrate/Competitorn/a
Meas. Tech.Electrophysiological Assay (In Vitro Assay)
IC50 28.1±n/a nM
Citation Chowdhury, SDehnhardt, CMFocken, TGrimwood, MEHemeon, IWJia, QOrtwine, DFSafina, BSun, SSutherlin, DPZenova, AY N-substituted benzamides and methods of use thereof US Patent US9771376 Publication Date 9/26/2017
 
Sodium channel protein type 9 subunit alpha
Name:Sodium channel protein type 9 subunit alpha
Type:Protein
Mol. Mass.:226375.97
Organism:Homo sapiens (Human)
Description:Q15858
Residue:1988
BDBM145247
NameBDBM145247
Synonyms:US8952169, 26 | US9771376, Example 26
TypeSmall organic molecule
Emp. Form.C20H26ClFN2O4S
Mol. Mass.444.948
SMILESCN(C)S(=O)(=O)NC(=O)c1cc(Cl)c(OCC23CC4CC(CC(C4)C2)C3)cc1F