Reaction Details
TargetSodium channel protein type 9 subunit alpha
LigandBDBM145303
Substrate/Competitorn/a
Meas. Tech.Electrophysiological Assay (In Vitro Assay)
IC50 41.6±n/a nM
Citation Chowdhury, SDehnhardt, CMFocken, TGrimwood, MEHemeon, IWJia, QOrtwine, DFSafina, BSun, SSutherlin, DPZenova, AY N-substituted benzamides and methods of use thereof US Patent US9771376 Publication Date 9/26/2017
 
Sodium channel protein type 9 subunit alpha
Name:Sodium channel protein type 9 subunit alpha
Type:Protein
Mol. Mass.:226375.97
Organism:Homo sapiens (Human)
Description:Q15858
Residue:1988
BDBM145303
NameBDBM145303
Synonyms:US8952169, 82 | US9771376, Example 82
TypeSmall organic molecule
Emp. Form.C15H17ClF4N2O4S
Mol. Mass.432.818
SMILESCN(C)S(=O)(=O)NC(=O)c1cc(Cl)c(OCC2(CCC2)C(F)(F)F)cc1F