Reaction Details
TargetSodium channel protein type 9 subunit alpha
LigandBDBM145307
Substrate/Competitorn/a
Meas. Tech.Electrophysiological Assay (In Vitro Assay)
IC50 1.31±n/a nM
Citation Chowdhury, SDehnhardt, CMFocken, TGrimwood, MEHemeon, IWJia, QOrtwine, DFSafina, BSun, SSutherlin, DPZenova, AY N-substituted benzamides and methods of use thereof US Patent US9771376 Publication Date 9/26/2017
 
Sodium channel protein type 9 subunit alpha
Name:Sodium channel protein type 9 subunit alpha
Type:Protein
Mol. Mass.:226375.97
Organism:Homo sapiens (Human)
Description:Q15858
Residue:1988
BDBM145307
NameBDBM145307
Synonyms:US8952169, 86 | US9771376, Example 86
TypeSmall organic molecule
Emp. Form.C22H29NO4S
Mol. Mass.403.535
SMILESCS(=O)(=O)NC(=O)c1ccc(OCC23CC4CC(CC(C4)C2)C3)c(c1)C1CC1