Reaction Details
TargetSodium channel protein type 9 subunit alpha
LigandBDBM145368
Substrate/Competitorn/a
Meas. Tech.Electrophysiological Assay (In Vitro Assay)
IC50 6.70±n/a nM
Citation Chowdhury, SDehnhardt, CMFocken, TGrimwood, MEHemeon, IWJia, QOrtwine, DFSafina, BSun, SSutherlin, DPZenova, AY N-substituted benzamides and methods of use thereof US Patent US9771376 Publication Date 9/26/2017
 
Sodium channel protein type 9 subunit alpha
Name:Sodium channel protein type 9 subunit alpha
Type:Protein
Mol. Mass.:226375.97
Organism:Homo sapiens (Human)
Description:Q15858
Residue:1988
BDBM145368
NameBDBM145368
Synonyms:US8952169, 147 | US9771376, Example 147
TypeSmall organic molecule
Emp. Form.C25H33FN2O5S
Mol. Mass.492.603
SMILESO[C@H]1CCN(C1)S(=O)(=O)NC(=O)c1cc(C2CC2)c(OCC23CC4CC(CC(C4)C2)C3)cc1F