Reaction Details
TargetcAMP-specific 3',5'-cyclic phosphodiesterase 4B
LigandBDBM14370
Substrate/CompetitorBDBM10851
Meas. Tech.PDE Activity Assay
Ki 11.0±n/a nM
Citation Whitehead, JWLee, GPGharagozloo, PHofer, PGehrig, AWintergerst, PSmyth, DMcCoull, WHachicha, MPatel, AKyle, DJ 8-Substituted analogues of 3-(3-cyclopentyloxy-4-methoxy-benzyl)-8-isopropyladenine: highly potent and selective PDE4 inhibitors. J Med Chem48:1237-43 (2005) 
 
cAMP-specific 3',5'-cyclic phosphodiesterase 4B
Name:cAMP-specific 3',5'-cyclic phosphodiesterase 4B
Type:Protein
Mol. Mass.:83318.87
Organism:Homo sapiens (Human)
Description:Q07343
Residue:736
BDBM14370
BDBM10851
NameBDBM14370
Synonyms:8-{1-[(4-Chlorobenzyl)oxy]-1-methyl-ethyl}-3-[3-cyclopentyloxy)-4-methoxybenzyl]-3H-purin-6-amine V11294 Analogue 5f
TypeSmall organic molecule
Emp. Form.C28H32ClN5O3
Mol. Mass.522.038
SMILESCOc1ccc(Cn2cnc(N)c3nc(nc23)C(C)(C)OCc2ccc(Cl)cc2)cc1OC1CCCC1