Reaction Details
TargetcAMP-specific 3',5'-cyclic phosphodiesterase 4B
LigandBDBM14382
Substrate/CompetitorBDBM10851
Meas. Tech.PDE Activity Assay
Ki 7.6±n/a nM
Citation Whitehead, JWLee, GPGharagozloo, PHofer, PGehrig, AWintergerst, PSmyth, DMcCoull, WHachicha, MPatel, AKyle, DJ 8-Substituted analogues of 3-(3-cyclopentyloxy-4-methoxy-benzyl)-8-isopropyladenine: highly potent and selective PDE4 inhibitors. J Med Chem48:1237-43 (2005) 
 
cAMP-specific 3',5'-cyclic phosphodiesterase 4B
Name:cAMP-specific 3',5'-cyclic phosphodiesterase 4B
Type:Protein
Mol. Mass.:83318.87
Organism:Homo sapiens (Human)
Description:Q07343
Residue:736
BDBM14382
BDBM10851
NameBDBM14382
Synonyms:4-{2-[6-Amino-3-(3-cyclopentyloxy-4-methoxy-benzyl)-3H-purin-8-yl]-2-methyl-propoxy}-benzamide Fumarate | V11294 Analogue 5r
TypeSmall organic molecule
Emp. Form.C29H34N6O4
Mol. Mass.530.6181
SMILESCOc1ccc(Cn2cnc(N)c3nc(nc23)C(C)(C)OCc2ccc(cc2)C(N)=O)cc1OC1CCCC1