Reaction Details
TargetcAMP-specific 3',5'-cyclic phosphodiesterase 4D
LigandBDBM14364
Substrate/CompetitorBDBM10851
Meas. Tech.PDE Activity Assay
Ki 141±n/a nM
Citation Whitehead, JWLee, GPGharagozloo, PHofer, PGehrig, AWintergerst, PSmyth, DMcCoull, WHachicha, MPatel, AKyle, DJ 8-Substituted analogues of 3-(3-cyclopentyloxy-4-methoxy-benzyl)-8-isopropyladenine: highly potent and selective PDE4 inhibitors. J Med Chem48:1237-43 (2005) 
 
cAMP-specific 3',5'-cyclic phosphodiesterase 4D
Name:cAMP-specific 3',5'-cyclic phosphodiesterase 4D
Type:Protein
Mol. Mass.:91092.69
Organism:Homo sapiens (Human)
Description:Q08499
Residue:809
BDBM14364
BDBM10851
NameBDBM14364
Synonyms:3-(3-Cyclopentyloxy-4-methoxy-benzyl)-8-isopropyl-adenine V11294
TypeSmall organic molecule
Emp. Form.C23H31N5O2
Mol. Mass.409.5245
SMILESCCNc1ncn(Cc2ccc(OC)c(OC3CCCC3)c2)c2nc(nc12)C(C)C