Reaction Details
TargetcAMP-specific 3',5'-cyclic phosphodiesterase 4D
LigandBDBM14374
Substrate/CompetitorBDBM10851
Meas. Tech.PDE Activity Assay
Ki 7.9±n/a nM
Citation Whitehead, JWLee, GPGharagozloo, PHofer, PGehrig, AWintergerst, PSmyth, DMcCoull, WHachicha, MPatel, AKyle, DJ 8-Substituted analogues of 3-(3-cyclopentyloxy-4-methoxy-benzyl)-8-isopropyladenine: highly potent and selective PDE4 inhibitors. J Med Chem48:1237-43 (2005) 
 
cAMP-specific 3',5'-cyclic phosphodiesterase 4D
Name:cAMP-specific 3',5'-cyclic phosphodiesterase 4D
Type:Protein
Mol. Mass.:91092.69
Organism:Homo sapiens (Human)
Description:Q08499
Residue:809
BDBM14374
BDBM10851
NameBDBM14374
Synonyms:(2E)-but-2-enedioic acid; 3-{[3-(cyclopentyloxy)-4-methoxyphenyl]methyl}-8-{2-[(3,5-dimethoxyphenyl)methoxy]propan-2-yl}-3H-purin-6-amine V11294 Analogue 5j
TypeSmall organic molecule
Emp. Form.C30H37N5O5
Mol. Mass.547.6453
SMILESCOc1cc(COC(C)(C)c2nc3c(N)ncn(Cc4ccc(OC)c(OC5CCCC5)c4)c3n2)cc(OC)c1