Reaction Details
TargetVascular endothelial growth factor receptor 2
LigandBDBM342487
Substrate/Competitorn/a
Meas. Tech.Inhibition Kinases In Vitro Assay
IC50 70.4±n/a nM
Citation Zdzalik, DLipner, JWieczorek, MDzwonek, KYamani, ADubiel, KLamparska-Przybysz, MGrygielewicz, PStanczak, A Pyrazolylbenzo[d]imidazole derivatives US Patent US9776988 Publication Date 10/3/2017
 
Vascular endothelial growth factor receptor 2
Name:Vascular endothelial growth factor receptor 2
Type:Receptor Tyrosine Kinase
Mol. Mass.:151510.97
Organism:Homo sapiens (Human)
Description:P35968
Residue:1356
BDBM342487
NameBDBM342487
Synonyms:US9776988, Example 3
TypeSmall organic molecule
Emp. Form.C26H29N5O4
Mol. Mass.475.5396
SMILESCOc1cc(CCc2cc(n[nH]2)-c2nc3ccc(cc3[nH]2)C(=O)NC2CCOCC2)cc(OC)c1