Reaction Details
TargetcGMP-specific 3',5'-cyclic phosphodiesterase
LigandBDBM14392
Substrate/CompetitorBDBM14391
Meas. Tech.PDE Enzyme Inhibitor Assays
pH7.4±n/a
Temperature303.15±n/a K
IC50 1.3±n/a nM
CommentscGMP in a 3:1 ratio unlabeled to 3H-labeled at a concentration 1/3Km, such that IC50 = Ki.
Citation Allerton, CMBarber, CGBeaumont, KCBrown, DGCole, SMEllis, DLane, CAMaw, GNMount, NMRawson, DJRobinson, CMStreet, SDSummerhill, NW A novel series of potent and selective PDE5 inhibitors with potential for high and dose-independent oral bioavailability. J Med Chem49:3581-94 (2006) 
 
cGMP-specific 3',5'-cyclic phosphodiesterase
Name:cGMP-specific 3',5'-cyclic phosphodiesterase
Type:Protein
Mol. Mass.:99975.83
Organism:Homo sapiens (Human)
Description:O76074
Residue:875
BDBM14392
BDBM14391
NameBDBM14392
Synonyms:3-ethyl-5-{5-[(4-ethylpiperazine-1-)sulfonyl]-2-(2-methoxyethoxy)pyridin-3-yl}-2-(pyridin-2-ylmethyl)-2H,6H,7H-pyrazolo[4,3-d]pyrimidin-7-one Sildenafil Pyridyl Methyl Analogue 1
TypeSmall organic molecule
Emp. Form.C27H34N8O5S
Mol. Mass.582.674
SMILESCCN1CCN(CC1)S(=O)(=O)c1cnc(OCCOC)c(c1)-c1nc2c(CC)n(Cc3ccccn3)nc2c(=O)[nH]1