Reaction Details
TargetRetinal rod rhodopsin-sensitive cGMP 3',5'-cyclic phosphodiesterase subunit gamma
LigandBDBM14394
Substrate/CompetitorBDBM14391
Meas. Tech.PDE Enzyme Inhibitor Assays
pH7.4±n/a
Temperature303.15±n/a K
IC50 183±n/a nM
CommentscGMP in a 3:1 ratio unlabeled to 3H-labeled at a concentration 1/3Km, such that IC50 = Ki.
Citation Allerton, CMBarber, CGBeaumont, KCBrown, DGCole, SMEllis, DLane, CAMaw, GNMount, NMRawson, DJRobinson, CMStreet, SDSummerhill, NW A novel series of potent and selective PDE5 inhibitors with potential for high and dose-independent oral bioavailability. J Med Chem49:3581-94 (2006) 
 
Retinal rod rhodopsin-sensitive cGMP 3',5'-cyclic phosphodiesterase subunit gamma
Name:Retinal rod rhodopsin-sensitive cGMP 3',5'-cyclic phosphodiesterase subunit gamma
Type:Enzyme
Mol. Mass.:9656.12
Organism:Canis lupus familiaris (Dog)
Description:n/a
Residue:87
BDBM14394
BDBM14391
NameBDBM14394
Synonyms:5-(2-butoxy-5-acetylpyridin-3-yl)-3-ethyl-2-(pyridin-2-ylmethyl)-2H,6H,7H-pyrazolo[4,3-d]pyrimidin-7-one Sildenafil 5-methyl ketone analogue 9
TypeSmall organic molecule
Emp. Form.C24H26N6O3
Mol. Mass.446.5016
SMILESCCCCOc1ncc(cc1-c1nc2c(CC)n(Cc3ccccn3)nc2c(=O)[nH]1)C(C)=O