Reaction Details
TargetRetinal rod rhodopsin-sensitive cGMP 3',5'-cyclic phosphodiesterase subunit gamma
LigandBDBM14395
Substrate/CompetitorBDBM14391
Meas. Tech.PDE Enzyme Inhibitor Assays
pH7.4±n/a
Temperature303.15±n/a K
IC50>3000±n/a nM
CommentscGMP in a 3:1 ratio unlabeled to 3H-labeled at a concentration 1/3Km, such that IC50 = Ki.
Citation Allerton, CMBarber, CGBeaumont, KCBrown, DGCole, SMEllis, DLane, CAMaw, GNMount, NMRawson, DJRobinson, CMStreet, SDSummerhill, NW A novel series of potent and selective PDE5 inhibitors with potential for high and dose-independent oral bioavailability. J Med Chem49:3581-94 (2006) 
 
Retinal rod rhodopsin-sensitive cGMP 3',5'-cyclic phosphodiesterase subunit gamma
Name:Retinal rod rhodopsin-sensitive cGMP 3',5'-cyclic phosphodiesterase subunit gamma
Type:Enzyme
Mol. Mass.:9656.12
Organism:Canis lupus familiaris (Dog)
Description:n/a
Residue:87
BDBM14395
BDBM14391
NameBDBM14395
Synonyms:5-[2-Butoxy-5-(1-hydroxyethyl)-3-pyridinyl]-3-ethyl-2-(1-ethyl-3-azetidinyl) -2,6-dihydro-7H-pyrazolo[4,3-d]pyrimidin-7-one Sildenafil 5-methyl alcohol analogue 55
TypeSmall organic molecule
Emp. Form.C23H32N6O3
Mol. Mass.440.5386
SMILESCCCCOc1ncc(cc1-c1nc2c(CC)n(nc2c(=O)[nH]1)C1CN(CC)C1)C(C)O