Reaction Details
TargetSerine protease 1
LigandBDBM14482
Substrate/CompetitorBDBM12679
Meas. Tech.Enzyme Assay and Determination of the Inhibition Constants
pH7.4±n/a
Temperature295.15±n/a K
Ki 37000±n/a nM
Citation Katz, BALuong, CHo, JDSomoza, JRGjerstad, ETang, JWilliams, SRVerner, EMackman, RLYoung, WBSprengeler, PAChan, HMortara, KJanc, JWMcGrath, ME Dissecting and designing inhibitor selectivity determinants at the S1 site using an artificial Ala190 protease (Ala190 uPA). J Mol Biol344:527-47 (2004) 
 
Serine protease 1
Name:Serine protease 1
Type:Enzyme
Mol. Mass.:26557.80
Organism:Homo sapiens (Human)
Description:P07477
Residue:247
BDBM14482
BDBM12679
NameBDBM14482
Synonyms:2-amino-5-[(3-hydroxynaphthalene-2-)amido]-1H-1,3-benzodiazol-3-ium | CA-24
TypeSmall organic molecule
Emp. Form.C18H15N4O2
Mol. Mass.319.3368
SMILESNc1[nH]c2ccc(NC(=O)c3cc4ccccc4cc3O)cc2[nH+]1