Reaction Details
TargetUrokinase-type plasminogen activator [179-431,I214M,N322A,S371A]
LigandBDBM14169
Substrate/CompetitorBDBM14484
Meas. Tech.Enzyme Assay and Determination of the Inhibition Constants
Ki 1700±n/a nM
Citation Katz, BALuong, CHo, JDSomoza, JRGjerstad, ETang, JWilliams, SRVerner, EMackman, RLYoung, WBSprengeler, PAChan, HMortara, KJanc, JWMcGrath, ME Dissecting and designing inhibitor selectivity determinants at the S1 site using an artificial Ala190 protease (Ala190 uPA). J Mol Biol344:527-47 (2004) 
 
Urokinase-type plasminogen activator [179-431,I214M,N322A,S371A]
Name:Urokinase-type plasminogen activator [179-431,I214M,N322A,S371A]
Type:Enzyme
Mol. Mass.:28389.65
Organism:Homo sapiens (Human)
Description:Mutagenically deglycosylated (N145A) low molecular mass urokinase (S190A), referred to as Ala190 uPA.
Residue:253
BDBM14169
BDBM14484
NameBDBM14169
Synonyms:4-Iodobenzo[b]thiophene-2-carboxamidine CA-01 [amino(4-iodo-1-benzothiophen-2-yl)methylidene]azanium
TypeSmall organic molecule
Emp. Form.C9H8IN2S
Mol. Mass.303.142
SMILESNC(=[NH2+])c1cc2c(I)cccc2s1