Reaction Details
TargetUrokinase-type plasminogen activator [179-431,I214M,N322A,S371A]
LigandBDBM14150
Substrate/CompetitorBDBM14484
Meas. Tech.Enzyme Assay and Determination of the Inhibition Constants
Ki 1600±n/a nM
Citation Katz, BALuong, CHo, JDSomoza, JRGjerstad, ETang, JWilliams, SRVerner, EMackman, RLYoung, WBSprengeler, PAChan, HMortara, KJanc, JWMcGrath, ME Dissecting and designing inhibitor selectivity determinants at the S1 site using an artificial Ala190 protease (Ala190 uPA). J Mol Biol344:527-47 (2004) 
 
Urokinase-type plasminogen activator [179-431,I214M,N322A,S371A]
Name:Urokinase-type plasminogen activator [179-431,I214M,N322A,S371A]
Type:Enzyme
Mol. Mass.:28389.65
Organism:Homo sapiens (Human)
Description:Mutagenically deglycosylated (N145A) low molecular mass urokinase (S190A), referred to as Ala190 uPA.
Residue:253
BDBM14150
BDBM14484
NameBDBM14150
Synonyms:APC-11417 CRA-11417 | {amino[6-fluoro-2-(2-hydroxy-3-phenylphenyl)-1H-indol-5-yl]methylidene}azanium
TypeSmall organic molecule
Emp. Form.C21H17FN3O
Mol. Mass.346.377
SMILESNC(=[NH2+])c1cc2cc([nH]c2cc1F)-c1cccc(-c2ccccc2)c1O