Reaction Details
TargetSerine protease hepsin
LigandBDBM14142
Substrate/CompetitorBDBM13573
Meas. Tech.Enzyme Assay and Determination of the Inhibition Constants
Ki 85±n/a nM
Citation Katz, BALuong, CHo, JDSomoza, JRGjerstad, ETang, JWilliams, SRVerner, EMackman, RLYoung, WBSprengeler, PAChan, HMortara, KJanc, JWMcGrath, ME Dissecting and designing inhibitor selectivity determinants at the S1 site using an artificial Ala190 protease (Ala190 uPA). J Mol Biol344:527-47 (2004) 
 
Serine protease hepsin
Name:Serine protease hepsin
Type:Enzyme
Mol. Mass.:45016.98
Organism:Homo sapiens (Human)
Description:Human deglycosylated hepsin was expressed in Pichia pastoris.
Residue:417
BDBM14142
BDBM13573
NameBDBM14142
Synonyms:2-{5-[amino(iminiumyl)methyl]-1H-indol-2-yl}-6-phenylbenzen-1-olate APC-8696 CRA-8696
TypeSmall organic molecule
Emp. Form.C21H17N3O
Mol. Mass.327.3792
SMILESNC(=[NH2+])c1ccc2[nH]c(cc2c1)-c1cccc(-c2ccccc2)c1[O-]