Reaction Details
TargetSodium channel protein type 9 subunit alpha
LigandBDBM342895
Substrate/Competitorn/a
Meas. Tech.In Vitro PX Assay
IC50 86.2±n/a nM
Citation Weiss, MDiMauro, EFDineen, TGraceffa, RGuzman-Perez, AHuang, HKreiman, CMarx, IENguyen, HNPeterson, EADeak, HL Bicyclic sulfonamide compounds as sodium channel inhibitors US Patent US9776995 Publication Date 10/3/2017
 
Sodium channel protein type 9 subunit alpha
Name:Sodium channel protein type 9 subunit alpha
Type:Protein
Mol. Mass.:226375.97
Organism:Homo sapiens (Human)
Description:Q15858
Residue:1988
BDBM342895
NameBDBM342895
Synonyms:1-(2-chloro-3'-fluoro-5-methoxy-4-biphenylyl)-N-2-pyrimidinyl-6-isoquinolinesulfonamide | US9776995, Example 108
TypeSmall organic molecule
Emp. Form.C26H18ClFN4O3S
Mol. Mass.520.963
SMILESCOc1cc(c(Cl)cc1-c1nccc2cc(ccc12)S(=O)(=O)Nc1ncccn1)-c1cccc(F)c1