Reaction Details
TargetMethylosome protein 50/Protein arginine N-methyltransferase 5
LigandBDBM343953
Substrate/Competitorn/a
Meas. Tech.Enzyme Assay
IC50<100±n/a nM
Citation Duncan, KWChesworth, RMunchhof, MJJin, L PRMT5 inhibitors and uses thereof US Patent US9777008 Publication Date 10/3/2017
 
Methylosome protein 50/Protein arginine N-methyltransferase 5
Name:Methylosome protein 50/Protein arginine N-methyltransferase 5
Type:Protein
Mol. Mass.:n/a
Description:n/a
Components:This complex has 2 components.
Component 1
Name:Protein arginine N-methyltransferase 5
Synonyms:72 kDa ICln-binding protein HRMT1L5 IBP72 Jak-binding protein 1 PRMT5/MEP50 complex Protein arginine methyltransferase 5 (PRMT5) SKB1 homolog Shk1 kinase-binding protein 1 homolog
Type:Enzyme
Mol. Mass.:72679.99
Organism:Homo sapiens (Human)
Description:O14744
Residue:637
Component 2
Name:Methylosome protein 50
Synonyms:Androgen receptor cofactor p44 MEP50 Nbla10071 WD45 p44/Mep50
Type:Enzyme
Mol. Mass.:36713.38
Organism:Homo sapiens (Human)
Description:Q9BQA1
Residue:342
BDBM343953
NameBDBM343953
Synonyms:US9777008, Compound 247
TypeSmall organic molecule
Emp. Form.C30H36N8O2
Mol. Mass.540.6592
SMILESCN1CCN(CC1)C(=O)Cn1ccc2cnc(nc12)-c1ccnc(NCC(O)CN2CCc3ccccc3C2)c1