Reaction Details
TargetCoagulation factor VII
LigandBDBM14514
Substrate/CompetitorBDBM14496
Meas. Tech.TF-VIIa Assay
pH8±n/a
Temperature295.15±n/a K
IC50 200±n/a nM
Citation Parlow, JJCase, BLDice, TAFenton, RLHayes, MJJones, DENeumann, WLWood, RSLachance, RMGirard, TJNicholson, NSClare, MStegeman, RAStevens, AMStallings, WCKurumbail, RGSouth, MS Design, parallel synthesis, and crystal structures of pyrazinone antithrombotics as selective inhibitors of the tissue factor VIIa complex. J Med Chem46:4050-62 (2003) 
 
Coagulation factor VII
Name:Coagulation factor VII
Type:Enzyme
Mol. Mass.:51599.89
Organism:Homo sapiens (Human)
Description:n/a
Residue:466
BDBM14514
BDBM14496
NameBDBM14514
Synonyms:(2R)-N-[(1S)-1-{[(2S)-5-carbamimidamido-1-oxo-1-(1,3-thiazol-2-yl)pentan-2-yl]carbamoyl}-2-(pyridin-3-yl)ethyl]-3-phenyl-2-(phenylmethane)sulfonamidopropanamide Ketothiazole inhibitor 1
TypeSmall organic molecule
Emp. Form.C33H38N8O5S2
Mol. Mass.690.835
SMILES[#7]\[#6](-[#7])=[#7]/[#6]-[#6]-[#6]-[#6@H](-[#7]-[#6](=O)-[#6@H](-[#6]-c1cccnc1)-[#7]-[#6](=O)-[#6@@H](-[#6]-c1ccccc1)-[#7]S(=O)(=O)[#6]-c1ccccc1)-[#6](=O)-c1nccs1